{"text_format":"1","workbook":"xlsx","n_sheets":10,"sheets":["Introduction","Tariff Calculation","Financing","Costs and Benefits","CBA","Data","LCOE","Capital cost","Interest rate & loan","Monthly-data"],"not_rendered":{"charts":13,"images":3,"macros":1,"external_links":0,"defined_names":214,"comments":2,"pivot_tables":0},"unopened":[],"bounds":{"document_bytes":16777216,"sheet_cells":100000,"rows_first":2000,"rows_last":500,"rows_between":2000,"halvings":0,"cell_chars":16384,"cell_head_chars":4096},"cells_cut":0,"cells_raw":0,"read":"whole","date_system":"1900"}

{"sheet":"Introduction","index":0,"n_rows":188,"n_cols":54,"rows_kept":188,"cut":false,"hidden":false,"merged":[[0,2,0,17],[112,3,112,18],[129,48,130,69],[131,39,131,70],[132,39,132,70],[133,39,133,70],[134,39,134,70],[135,39,135,70],[116,1,117,67],[123,3,124,67],[129,3,135,11],[129,12,135,38],[83,2,85,67],[86,2,86,67],[87,2,87,67],[89,2,89,67],[96,2,96,67],[103,2,103,67],[104,2,104,67],[105,3,105,67],[106,3,106,67],[107,3,107,15],[108,3,108,15],[109,3,109,67],[110,3,110,17],[111,3,111,21],[59,48,65,67],[66,48,69,67],[70,48,76,67],[187,4,187,66],[181,3,182,66],[184,4,184,66],[185,4,185,66],[113,0,115,67],[118,0,120,67],[126,3,126,67],[121,3,122,67],[155,3,155,67],[136,39,137,41],[140,12,144,38],[140,39,141,41],[128,12,128,38],[128,39,128,70],[128,3,128,11],[80,0,82,67],[145,39,147,70],[148,39,150,70],[174,4,175,22],[30,1,32,1],[36,1,38,1],[45,36,45,38],[36,32,38,54],[30,2,32,9],[33,2,35,9],[36,2,38,9],[40,0,41,67],[43,28,43,30],[33,1,35,1],[1,0,3,67],[5,0,6,67],[24,0,25,67],[19,2,20,67],[29,32,29,54],[29,10,29,31],[29,2,29,9],[54,48,58,67],[78,0,79,67],[63,2,75,21],[54,25,58,44],[59,25,61,44],[62,25,67,44],[59,2,62,21],[54,2,58,21],[49,0,50,67],[51,0,53,22],[51,23,53,45],[51,46,53,67],[30,10,32,31],[30,32,32,54],[33,10,35,31],[33,32,35,54],[36,10,38,31],[176,4,177,22],[140,3,144,11],[136,48,137,67],[140,48,141,70],[148,3,150,11],[148,12,150,38],[136,3,139,11],[136,12,139,38],[145,3,147,11],[145,12,147,38],[157,23,157,47],[158,23,165,47],[166,4,166,22],[167,4,167,22],[172,4,173,22],[172,23,173,25],[172,26,173,47],[143,39,143,70],[144,39,144,70],[178,4,179,22],[129,39,130,41],[176,23,177,25],[176,26,177,47],[178,23,179,25],[178,26,179,47],[166,23,167,47],[171,4,171,22],[171,23,171,47],[157,4,157,22],[158,4,158,22],[159,4,159,22],[160,4,160,22],[161,4,161,22],[162,4,162,22],[163,4,163,22],[164,4,164,22],[165,4,165,22],[138,39,138,70],[139,39,139,70],[142,39,142,70],[174,23,175,25],[174,26,175,47],[152,3,153,67]]}
[]
["Introduction to the Tariff Analysis Tool"]
[]
[]
[]
["Before You Start"]
{"$rows_left_out":183}
{"sheet":"Tariff Calculation","index":1,"n_rows":198,"n_cols":62,"rows_kept":198,"cut":false,"hidden":false,"merged":[[0,0,2,67],[4,0,5,67],[19,47,19,49],[19,38,19,40],[33,11,33,13],[23,38,23,40],[7,11,7,13],[11,11,11,13],[20,13,27,20],[11,21,11,23],[27,38,27,40],[25,38,25,40],[29,11,29,13],[29,38,29,40],[18,31,20,36],[35,11,35,13],[37,11,37,13],[31,38,31,40],[43,0,44,67],[50,58,50,60],[39,11,39,13],[31,11,31,13],[50,22,53,27],[31,45,33,59],[49,22,49,45],[50,48,50,57],[47,1,47,14],[51,58,59,66],[56,34,61,46],[41,11,41,13],[62,36,63,42],[62,6,63,12],[62,56,63,62],[56,22,59,27],[138,10,138,12],[144,10,144,12],[141,10,141,12],[81,0,82,67],[126,52,127,56],[126,58,127,66],[126,38,127,49],[111,10,111,12],[119,10,121,28],[101,58,101,62],[103,58,103,62],[129,52,129,56],[131,52,131,56],[129,58,129,66],[131,58,131,66],[163,10,163,12],[166,10,166,12],[187,10,187,12],[160,10,160,12],[160,16,160,18],[163,16,163,18],[146,10,148,28],[175,37,177,48],[197,5,199,29],[93,10,93,12],[87,10,87,12],[117,10,117,12],[90,10,90,12],[87,13,88,30],[101,36,103,47],[95,10,99,30],[163,19,164,31],[171,5,173,32],[114,10,114,12],[190,10,190,12],[193,10,193,12],[166,16,166,18],[175,59,175,65],[177,59,177,65],[101,50,101,56],[103,48,103,56],[175,50,175,57],[177,50,177,57],[129,45,129,50],[131,43,131,50]]}
["PM-KUSUM Tariff Analysis"]
[]
[]
[]
["Input"]
[]
{"$rows_left_out":193}
{"sheet":"Financing","index":2,"n_rows":177,"n_cols":49,"rows_kept":177,"cut":false,"hidden":false,"merged":[[193,2,194,9],[193,10,194,23],[187,10,188,23],[184,10,185,23],[183,10,183,23],[187,2,188,9],[183,2,183,9],[184,2,185,9],[190,2,191,9],[190,10,191,23],[36,2,37,20],[141,1,141,21],[176,2,177,25],[173,2,174,26],[170,1,170,6],[154,23,158,23],[169,1,169,5],[155,2,157,20],[152,2,154,20],[149,2,150,18],[107,2,110,21],[143,23,149,23],[142,1,145,20],[30,27,30,34],[28,27,28,34],[42,23,51,23],[26,23,35,23],[86,34,87,39],[84,23,93,23],[89,34,89,36],[91,34,91,36],[33,24,33,34],[35,24,35,34],[33,2,34,21],[121,1,122,7],[123,1,124,7],[147,2,148,19],[160,36,163,46],[93,38,98,48],[156,36,156,38],[154,36,154,38],[91,40,91,42],[93,34,93,36],[101,42,101,44],[105,42,105,44],[145,36,145,38],[143,36,143,38],[138,1,138,49],[90,2,91,21],[158,36,158,38],[158,40,158,42],[156,40,156,42],[154,40,154,42],[107,42,107,44],[109,42,109,44],[136,1,136,50],[147,36,147,38],[149,36,149,38],[101,23,109,23],[103,2,105,21],[139,1,139,19],[19,1,19,50],[0,0,2,50],[48,43,48,45],[51,43,51,45],[35,40,39,49],[12,1,12,14],[12,15,12,28],[25,1,31,20],[26,24,26,38],[28,36,28,38],[30,36,30,38],[33,36,33,38],[35,36,35,38],[44,43,44,45],[46,43,46,45],[42,43,42,45],[42,47,42,49],[44,47,44,49],[100,2,101,21],[93,2,96,21],[89,40,89,42],[78,1,78,50],[49,2,52,20],[63,1,64,8],[66,1,67,8],[83,1,87,20],[82,1,82,21],[56,1,59,8],[60,1,60,8],[61,1,62,8],[45,2,47,20],[41,2,43,20]]}
["Financing"]
[]
[]
[]
[null,"In this section, we analyze the scope of different financing options available for PM-KUSUM"]
[]
{"$rows_left_out":172}
{"sheet":"Costs and Benefits","index":3,"n_rows":65,"n_cols":69,"rows_kept":65,"cut":false,"hidden":false,"merged":[[4,1,4,20],[4,23,4,45],[7,63,7,65],[15,13,15,16],[8,36,8,38],[10,36,10,38],[6,7,6,12],[4,48,4,75],[8,7,8,12],[15,2,23,11],[8,63,8,65],[9,63,9,65],[6,63,6,65],[14,63,14,65],[13,63,13,65],[15,63,15,65],[28,63,28,65],[29,63,29,65],[30,63,30,65],[16,63,16,65],[22,63,22,65],[24,63,24,65],[25,63,25,65],[27,63,27,65],[26,63,26,65],[37,0,37,40],[11,13,11,16],[13,13,13,16],[40,15,40,21],[40,22,40,30],[40,31,40,40],[25,24,26,34],[25,36,25,38],[22,36,22,38],[22,24,23,34],[12,36,12,38],[14,36,14,38],[44,46,44,49],[46,37,46,40],[46,27,46,30],[46,18,46,21],[43,18,43,21],[45,27,45,30],[49,27,49,30],[25,94,25,96],[6,14,9,19],[6,40,11,44],[11,63,11,65],[10,63,10,65],[19,63,19,65],[20,63,20,65],[18,63,18,65],[7,68,11,72],[49,37,49,40],[43,46,43,49],[45,37,45,40],[44,18,44,21],[45,18,45,21],[49,18,49,21],[0,0,2,75],[52,46,52,49],[45,46,45,49],[46,46,46,49],[40,41,40,49],[50,18,50,21],[50,27,50,30],[50,37,50,40],[52,18,52,21],[49,46,49,49],[52,37,52,40],[52,27,52,30],[43,37,43,40],[43,27,43,30],[44,37,44,40],[44,27,44,30]]}
["Cost-Benefit Analysis"]
[]
[]
[]
[null,"DISCOM statistics",null,null,null,null,null,null,null,null,null,null,null,null,null,null,null,null,null,null,null,null,null,"Ambition on solarizing agricultural load",null,null,null,null,null,null,null,null,null,null,null,null,null,null,null,null,null,null,null,null,null,null,null,null,"Assumptions"]
[null,null,null,null,null,null,null,null,null,null,null,null,null,null,null,null,null,null,null,null,null,null,null,null,null,null,null,null,null,null,null,null,null,null,null,null,null,null,null,null,null,null,null,null,null,null,null,null,"Technical"]
{"$rows_left_out":60}
{"sheet":"CBA","index":4,"n_rows":65,"n_cols":33,"rows_kept":65,"cut":false,"hidden":true,"merged":[[8,1,8,4],[15,1,15,4],[1,6,1,31],[50,6,50,31],[0,1,0,4],[1,1,1,4],[18,6,18,31],[34,6,34,31]]}
[null,"Assumptions",null,null,null,null,"Year",1,2,3,4,5,6,7,8,9,10,11,12,13,14,15,16,17,18,19,20,21,22,23,24,25]
[null,"Technical",null,null,null,null,"Distributed solar power plants: Component A"]
[null,"Transmission losses",null,{"$f":"'Costs and Benefits'!BL7","v":5.2699999999999997E-2},null,null,"Component A",{"$f":"Capacity_Addition_A","v":100},100,100,100,100,100,100,100,100,100,100,100,100,100,100,100,100,100,100,100,100,100,100,100,100]
[null,"Annual transmission loss reduction (targeted)",null,{"$f":"'Costs and Benefits'!BL8","v":0},null,null,"Component A generation",{"$f":"H3*365*24*$D$17*1000","v":183960000},{"$f":"H4*(1-$D$19)","v":183040200},{"$f":"I4*(1-$D$19)","v":182124999},181214374.005,180308302.13497499,179406760.62430012,178509726.82117862,177617178.18707272,176729092.29613736,175845446.83465669,174966219.60048339,174091388.50248098,173220931.55996859,172354826.90216875,171493052.76765791,170635587.50381961,169782409.56630051,168933497.51846901,168088830.03087667,167248385.88072228,166412143.95131868,165580083.23156208,164752182.81540427,163928421.90132725,163108779.79182062,{"$f":"SUM(H4:AF4)","v":4333352821.4277}]
[null,"Distribution losses upto 11 kV substation",null,{"$f":"'Costs and Benefits'!BL9","v":0.114},null,null,"Transmission Loss (%)",{"$f":"$D$3-$D$4","v":5.2699999999999997E-2},{"$f":"H5-$D$4","v":5.2699999999999997E-2},{"$f":"I5-$D$4","v":5.2699999999999997E-2},5.2699999999999997E-2,5.2699999999999997E-2,5.2699999999999997E-2,5.2699999999999997E-2,5.2699999999999997E-2,5.2699999999999997E-2,5.2699999999999997E-2,5.2699999999999997E-2,5.2699999999999997E-2,5.2699999999999997E-2,5.2699999999999997E-2,5.2699999999999997E-2,5.2699999999999997E-2,5.2699999999999997E-2,5.2699999999999997E-2,5.2699999999999997E-2,5.2699999999999997E-2,5.2699999999999997E-2,5.2699999999999997E-2,5.2699999999999997E-2,5.2699999999999997E-2,5.2699999999999997E-2]
[null,"Annual distribution loss reduction (targeted)",null,{"$f":"'Costs and Benefits'!BL10","v":0},null,null,"Distribution Loss up to 11 kV (%)",{"$f":"$D$5-$D$6","v":0.114},{"$f":"H6-$D$4","v":0.114},{"$f":"I6-$D$4","v":0.114},0.114,0.114,0.114,0.114,0.114,0.114,0.114,0.114,0.114,0.114,0.114,0.114,0.114,0.114,0.114,0.114,0.114,0.114,0.114,0.114,0.114,0.114]
{"$rows_left_out":60}
{"sheet":"Data","index":5,"n_rows":19,"n_cols":19,"rows_kept":19,"cut":false,"hidden":true,"merged":[]}
["State","Discom","Total_Cons (MU)","Total_Agri_Cons (MU)","Agri_Cons_Solarized (MU)","Transmission_Loss (%)","Distribution_Loss_11kV (%)","Average_Fixed_Capacity_Charges","Average_Fixed_Transmission_Charges","Average_Variable_Cost_of_Power","Discount_Rate","Tariff_distributed","Tariff_utility","System Coincidence Factor","Transmission Coincidence Factor",null,null,null,{"$f":"_xlfn._xlws.FILTER(Data!$B$2:$B987,Data!$A$2:$A987='Costs and Benefits'!H7)","v":"BESCOM"}]
["India","All",{"$f":"SUMIF($B$3:$B$200, \"All\", C3:C300)","v":436696.33},{"$f":"SUMIF($B$3:$B$200, \"All\", D3:D300)","v":125785.79},{"$f":"SUMIF($B$3:$B$200, \"All\", E3:E300)","v":0},{"$f":"AVERAGEIF($B$3:$B$200, \"All\", F3:F300)","v":3.953333333333333E-2},{"$f":"AVERAGEIF($B$3:$B$200, \"All\", G3:G300)","v":9.2633333333333331E-2},{"$f":"AVERAGEIF($B$3:$B$200, \"All\", H3:H300)","v":7669.7908333333335},2289.4301222577428,2.9276666666666671,0.11616666666666665,3.0474999999999999,2.6566666666666667,0.28323097412480969,0.49458375190258752,null,null,null,"GESCOM"]
["Rajasthan","JVVNL",26534.11,9099.65,0,6.9900000000000004E-2,0.1681,6899.73,3609.73,2.96,0.11,3.14,2.5,0.2177,0.40550000000000003,null,null,null,"HESCOM"]
["Rajasthan","JdVVNL",23174.86,13252.74,0,6.9800000000000001E-2,0.21879999999999999,7231.3,3963.87,2.89,0.11,3.14,2.5,0.2177,0.40550000000000003,null,null,null,"CESC"]
["Rajasthan","AVVNL",19987.54,6499.62,0,5.74E-2,0.1515,7437.51,3425.14,2.5099999999999998,0.11,3.14,2.5,0.2177,0.40550000000000003,null,null,null,"MESCOM"]
["Rajasthan","All",69696.509999999995,28852.01,0,6.5699999999999995E-2,0.17949999999999999,7189.51,3666.25,2.79,0.11,3.14,2.5,0.2177,0.40550000000000003,null,null,null,"All"]
{"$rows_left_out":14}
{"sheet":"LCOE","index":6,"n_rows":82,"n_cols":37,"rows_kept":82,"cut":false,"hidden":true,"merged":[[49,4,68,4],[24,4,45,4],[0,4,18,4],[51,31,63,31],[2,31,14,31],[26,31,38,31],[36,0,38,0],[0,0,0,2],[9,0,10,0],[25,0,29,0],[30,0,31,0],[32,0,35,0],[1,0,3,0],[11,0,17,0],[4,0,8,0],[18,0,24,0]]}
["Key assumptions",null,null,null,"No subsidy","Year",1,2,3,4,5,6,7,8,9,10,11,12,13,14,15,16,17,18,19,20,21,22,23,24,25]
["Power generation","Capacity (MW)",{"$f":"plant_capacity","v":1},null,null,"Potential Generation (MWh)",{"$f":"$C$2*8760*$C$3/1000","v":1.8395999999999999},{"$f":"$C$2*8760*$C$3/1000","v":1.8395999999999999},1.8395999999999999,1.8395999999999999,1.8395999999999999,1.8395999999999999,1.8395999999999999,1.8395999999999999,1.8395999999999999,1.8395999999999999,1.8395999999999999,1.8395999999999999,1.8395999999999999,1.8395999999999999,1.8395999999999999,1.8395999999999999,1.8395999999999999,1.8395999999999999,1.8395999999999999,1.8395999999999999,1.8395999999999999,1.8395999999999999,1.8395999999999999,1.8395999999999999,1.8395999999999999]
[null,"Capacity Factor (%)",{"$f":"CUF","v":0.21},null,null,"Actual Generation (MWh)",{"$f":"G2*(1-$C$4)","v":1.802808},{"$f":"H2*(1-$C$4)","v":1.802808},1.802808,1.802808,1.802808,1.802808,1.802808,1.802808,1.802808,1.802808,1.802808,1.802808,1.802808,1.802808,1.802808,1.802808,1.802808,1.802808,1.802808,1.802808,1.802808,1.802808,1.802808,1.802808,1.802808,"Nominal"]
[null,"Grid availability",{"$f":"GridUnavail","v":0.02},null,null,"Return on Equity (INR Millions)",{"$f":"IF(G$1<=20,$C$19*$C$24,$C$19*$C$25)","v":1.5474639389312979},{"$f":"IF(H$1<=20,$C$19*$C$24,$C$19*$C$25)","v":1.5474639389312979},1.5474639389312979,1.5474639389312979,1.5474639389312979,1.5474639389312979,1.5474639389312979,1.5474639389312979,1.5474639389312979,1.5474639389312979,1.5474639389312979,1.5474639389312979,1.5474639389312979,1.5474639389312979,1.5474639389312979,1.5474639389312979,1.5474639389312979,1.5474639389312979,1.5474639389312979,1.5474639389312979,1.9629910679372884,1.9629910679372884,1.9629910679372884,1.9629910679372884,1.9629910679372884,null,null,null,null,"Tariff head","Contri per cost head"]
["Project Cost","Capital cost w/ DCR modules (INR Millions)",{"$f":"((C2*capital_cost_DCR)-(transmission_cost*(plant_capacity-1)))*10","v":39.856200000000001},null,null,"Discounted per unit Return on Equity (INR Millions)",{"$f":"G4*G18/LCOE_Actual_Generation","v":0.85836314179396689},0.78597759226153041,0.71969629805646285,0.65900448885039864,0.60343080476829647,0.55254363559574371,0.50594776869999525,0.46328131963099506,0.42421292156404816,0.38843915175608895,0.35568217502825206,0.32568758597296832,0.29822243312719909,0.27307340976664796,0.25004519726984481,0.22895894818592424,0.20965089722491873,0.19197108938289384,0.17578221532397403,0.16095854497431092,0.18696095926545303,0.17119458822899764,0.15675779132735523,0.1435384459055486,0.13143388458411323,null,null,null,null,"Return on Equity  ",{"$f":"SUM(G5:AE5)/AF18","v":0.87421552220286691}]
[null,"Capital cost w/ non-DCR modules (INR Millions)",{"$f":"((C2*capital_cost_nonDCR)-(transmission_cost*(plant_capacity-1)))*10","v":30.407666399999993},null,null,"Depreciation (INR Millions)",{"$f":"IF(G$1<=$C$26,$C$6*$C$27,$C$6*$C$28)","v":1.4200380208799996},{"$f":"IF(H$1<=$C$26,$C$6*$C$27,$C$6*$C$28)","v":1.4200380208799996},1.4200380208799996,1.4200380208799996,1.4200380208799996,1.4200380208799996,1.4200380208799996,1.4200380208799996,1.4200380208799996,1.4200380208799996,1.4200380208799996,1.4200380208799996,1.4200380208799996,1.4200380208799996,1.4200380208799996,0.60815332799999988,0.60815332799999988,0.60815332799999988,0.60815332799999988,0.60815332799999988,0.60815332799999988,0.60815332799999988,0.60815332799999988,0.60815332799999988,0.60815332799999988]
{"$rows_left_out":77}
{"sheet":"Capital cost","index":7,"n_rows":8,"n_cols":4,"rows_kept":8,"cut":false,"hidden":true,"merged":[]}
[null,null,"Pre-GST","Post GST"]
["Module prices (INR Millions) ","International",{"$f":"LOOKUP(2,1/(Monthly_data[International modules (after duty)]>0),Monthly_data[International modules (after duty)])/10","v":0.92899999999999994},{"$f":"C2*(1+(0.12*0.7+0.18*0.3))","v":1.0572019999999998}]
[null,"Domestic",null,{"$f":"LOOKUP(2,1/(Monthly_data[Domestic modules]>0),Monthly_data[Domestic modules])/10","v":1.7730000000000001}]
["Inverter (INR Millions)",null,0.22,{"$f":"C4*(1+(0.12*0.7+0.18*0.3))","v":0.25035999999999997}]
["Mounting structure",null,0.35,{"$f":"C5*(1+(0.12*0.7+0.18*0.3))","v":0.39829999999999993}]
["BOS and civil costs",null,0.7,{"$f":"C6*(1+(0.12*0.7+0.18*0.3))","v":0.79659999999999986}]
{"$rows_left_out":3}
{"sheet":"Interest rate & loan","index":8,"n_rows":302,"n_cols":60,"rows_kept":302,"cut":false,"hidden":true,"merged":[[10,34,10,58],[0,4,0,11],[0,16,0,22],[0,25,0,32],[0,35,0,59],[5,34,5,58]]}
["Month","rate","Average rate",null,"KUSUM A",null,null,null,null,null,null,null,null,null,null,null,"No Subsidy",null,null,null,null,null,null,null,null,"KUSUM C",null,null,null,null,null,null,null,null,null,"Yearly interest on loan (Component A)"]
["2019-07-01",8.4000000000000005E-2,null,null,"Amount",{"$f":"LCOE!$C$12","v":21.285366479999993},null,"Month","Opening Balanace ","Principal Payment","Closing Balance","Interest Payment","Interest paid by govt","Interest paid by developer",null,"Amount",{"$f":"LCOE!$C$12","v":21.285366479999993},null,"Month","Opening Balanace ","Principal Payment","Closing Balance","Interest Payment",null,"Amount",{"$f":"LCOE!$C$13","v":20.549340000000001},null,"Year","Opening Balanace ","Principal Payment","Closing Balance","Interest Payment",null,null,1,2,3,4,5,6,7,8,9,10,11,12,13,14,15,16,17,18,19,20,21,22,23,24,25]
["2019-08-01",8.2500000000000004E-2,null,null,"Interest rate ",{"$f":"LCOE!C17","v":0.11},null,1,{"$f":"F2","v":21.285366479999993},{"$f":"-PPMT($F$3/12,$H3,$F$4,$F$2)","v":4.6812963520709253E-2},{"$f":"I3-J3","v":21.238553516479286},{"$f":"-IPMT($F$3/12,$H3,$F$4,$F$2)","v":0.19511585939999995},{"$f":"MIN(20,I3)*$F$5/12","v":0},{"$f":"L3-M3","v":0.19511585939999995},null,"Interest rate ",{"$f":"LCOE!C17","v":0.11},null,1,{"$f":"Q2","v":21.285366479999993},{"$f":"-PPMT($Q$3/12,$S3,$Q$4,$Q$2)","v":4.6812963520709253E-2},{"$f":"T3-U3","v":21.238553516479286},{"$f":"-IPMT($Q$3/12,$S3,$Q$4,$Q$2)","v":0.19511585939999995},null,"Interest rate ",{"$f":"LCOE!C17","v":0.11},null,1,{"$f":"Z2","v":20.549340000000001},{"$f":"-PPMT($Z$3/12,$AB3,$Z$4,$Z$2)","v":4.5194218511508184E-2},{"$f":"AC3-AD3","v":20.504145781488493},{"$f":"-IPMT($Z$3/12,$AB3,$Z$4,$Z$2)","v":0.18836895000000001},null,null,{"$f":"SUMIFS($N$3:$N$180,$H$3:$H$180,\">0\",$H$3:$H$180,\"<=12\")","v":2.3121849669613694},{"$f":"SUMIFS($N$3:$N$180,$H$3:$H$180,\">12\",$H$3:$H$180,\"<=24\")","v":2.243799658440659},{"$f":"SUMIFS($N$3:$N$180,$H$3:$H$180,\">24\",$H$3:$H$180,\"<=36\")","v":2.1675008816050814},{"$f":"SUMIFS($N$3:$N$180,$H$3:$H$180,\">36\",$H$3:$H$180,\"<=48\")","v":2.0823728991109727},{"$f":"SUMIFS($N$3:$N$180,$H$3:$H$180,\">48\",$H$3:$H$180,\"<=60\")","v":1.9873940055549988},{"$f":"SUMIFS($N$3:$N$180,$H$3:$H$180,\">60\",$H$3:$H$180,\"<=72\")","v":1.8814242649736186},{"$f":"SUMIFS($N$3:$N$180,$H$3:$H$180,\">72\",$H$3:$H$180,\"<=84\")","v":1.7631918293402524},{"$f":"SUMIFS($N$3:$N$180,$H$3:$H$180,\">84\",$H$3:$H$180,\"<=96\")","v":1.6312776738548671},{"$f":"SUMIFS($N$3:$N$180,$H$3:$H$180,\">96\",$H$3:$H$180,\"<=108\")","v":1.4840985658190395},{"$f":"SUMIFS($N$3:$N$180,$H$3:$H$180,\">108\",$H$3:$H$180,\"<=120\")","v":1.3198880626890559},{"$f":"SUMIFS($N$3:$N$180,$H$3:$H$180,\">120\",$H$3:$H$180,\"<=132\")","v":1.1366753112458403},{"$f":"SUMIFS($N$3:$N$180,$H$3:$H$180,\">132\",$H$3:$H$180,\"<=144\")","v":0.93226139342949266},{"$f":"SUMIFS($N$3:$N$180,$H$3:$H$180,\">144\",$H$3:$H$180,\"<=156\")","v":0.7041929349413335},{"$f":"SUMIFS($N$3:$N$180,$H$3:$H$180,\">156\",$H$3:$H$180,\"<=168\")","v":0.44973265986408811},{"$f":"SUMIFS($N$3:$N$180,$H$3:$H$180,\">168\",$H$3:$H$180,\"<=180\")","v":0.15925388863877479},{"$f":"SUMIFS($N$3:$N$180,$H$3:$H$180,\">180\",$H$3:$H$180,\"<=192\")","v":0},{"$f":"SUMIFS($N$3:$N$180,$H$3:$H$180,\">192\",$H$3:$H$180,\"<=204\")","v":0},{"$f":"SUMIFS($N$3:$N$180,$H$3:$H$180,\">204\",$H$3:$H$180,\"<=216\")","v":0},{"$f":"SUMIFS($N$3:$N$180,$H$3:$H$180,\">216\",$H$3:$H$180,\"<=228\")","v":0},{"$f":"SUMIFS($N$3:$N$180,$H$3:$H$180,\">228\",$H$3:$H$180,\"<=240\")","v":0},{"$f":"SUMIFS($N$3:$N$180,$H$3:$H$180,\">240\",$H$3:$H$180,\"<=252\")","v":0},{"$f":"SUMIFS($N$3:$N$180,$H$3:$H$180,\">252\",$H$3:$H$180,\"<=264\")","v":0},{"$f":"SUMIFS($N$3:$N$180,$H$3:$H$180,\">264\",$H$3:$H$180,\"<=276\")","v":0},{"$f":"SUMIFS($N$3:$N$180,$H$3:$H$180,\">276\",$H$3:$H$180,\"<=288\")","v":0},{"$f":"SUMIFS($N$3:$N$180,$H$3:$H$180,\">288\",$H$3:$H$180,\"<=300\")","v":0},{"$f":"SUM(AI3:BG3)","v":22.255248996469447}]
["2019-09-01",8.1500000000000003E-2,null,null,"Installments",{"$f":"12*LCOE!$C$14","v":180},null,2,{"$f":"K3","v":21.238553516479286},{"$f":"-PPMT($F$3/12,$H4,$F$4,$F$2)","v":4.7242082352982419E-2},{"$f":"I4-J4","v":21.191311434126302},{"$f":"-IPMT($F$3/12,$H4,$F$4,$F$2)","v":0.19468674056772678},{"$f":"MIN(20,I4)*$F$5/12","v":0},{"$f":"L4-M4","v":0.19468674056772678},null,"Installments",{"$f":"12*LCOE!$C$14","v":180},null,2,{"$f":"V3","v":21.238553516479286},4.7242082352982419E-2,{"$f":"T4-U4","v":21.191311434126302},{"$f":"-IPMT($Q$3/12,$S4,$Q$4,$Q$2)","v":0.19468674056772678},null,"Installments",{"$f":"12*LCOE!C14","v":180},null,2,{"$f":"AE3","v":20.504145781488493},4.5608498847863679E-2,{"$f":"AC4-AD4","v":20.458537282640631},0.18795466966364452]
["2019-10-01",8.0500000000000002E-2,null,null,"AIF",{"$f":"IF(LCOE!C16=1,3%,0)","v":0},null,3,{"$f":"K4","v":21.191311434126302},4.7675134774551417E-2,21.143636299351751,{"$f":"-IPMT($F$3/12,$H5,$F$4,$F$2)","v":0.19425368814615779},0,0.19425368814615779,null,null,null,null,3,{"$f":"V4","v":21.191311434126302},4.7675134774551417E-2,21.143636299351751,0.19425368814615779,null,null,null,null,3,{"$f":"AE4","v":20.458537282640631},4.6026576753969088E-2,20.41251070588666,0.18753659175753912]
["2019-11-01",0.08,null,null,null,null,null,4,21.143636299351751,4.8112156843318148E-2,21.095524142508435,{"$f":"-IPMT($F$3/12,$H6,$F$4,$F$2)","v":0.19381666607739101},0,0.19381666607739101,null,null,null,null,4,21.143636299351751,4.8112156843318148E-2,21.095524142508435,0.19381666607739101,null,null,null,null,4,20.41251070588666,4.6448487040880476E-2,20.36606221884578,0.18711468147062771,null,null,"Yearly interest on loan (Component C)"]
{"$rows_left_out":297}
{"sheet":"Monthly-data","index":9,"n_rows":65,"n_cols":9,"rows_kept":65,"cut":false,"hidden":true,"merged":[]}
["Month","International modules (after duty)","Domestic modules","Interest rate (6-month-average)",null,null,"Month","International Modules (INR crores/MW)","Domestic Modules (INR crores/MW)"]
["Jan-25",21.1,null,8.1299999999999997E-2,null,null,"2020-01-01",{"$f":"Monthly_data[[#This Row],[International modules (after duty)]]/10","v":2.1100000000000003},{"$error":"#N/A"}]
["Feb-25",20.3,null,8.0399999999999999E-2,null,null,"2020-02-01",{"$f":"Monthly_data[[#This Row],[International modules (after duty)]]/10","v":2.0300000000000002},{"$error":"#N/A"}]
["Mar-25",18.2,null,7.9799999999999996E-2,null,null,"2020-03-01",{"$f":"Monthly_data[[#This Row],[International modules (after duty)]]/10","v":1.8199999999999998},{"$error":"#N/A"}]
["Apr-25",16.399999999999999,null,7.9100000000000004E-2,null,null,"2020-04-01",{"$f":"Monthly_data[[#This Row],[International modules (after duty)]]/10","v":1.64},{"$error":"#N/A"}]
["May-25",16.100000000000001,null,7.8E-2,null,null,"2020-05-01",{"$f":"Monthly_data[[#This Row],[International modules (after duty)]]/10","v":1.61},{"$error":"#N/A"}]
{"$rows_left_out":59}